{"text_format":"1","workbook":"xlsx","n_sheets":3,"sheets":["FPag","CalTab","Recept"],"not_rendered":{"charts":0,"images":2,"macros":1,"external_links":0,"defined_names":0,"comments":1,"pivot_tables":0},"unopened":[],"bounds":{"document_bytes":16777216,"sheet_cells":100000,"rows_first":2000,"rows_last":500,"rows_between":2000,"halvings":0,"cell_chars":16384,"cell_head_chars":4096},"cells_cut":0,"cells_raw":0,"read":"whole","date_system":"1900"}

{"sheet":"FPag","index":0,"n_rows":0,"n_cols":0,"rows_kept":0,"cut":false,"hidden":false,"merged":[]}

{"sheet":"CalTab","index":1,"n_rows":992,"n_cols":8,"rows_kept":992,"cut":false,"hidden":false,"merged":[[1,1,1,2]]}
["Calorieëntabel"]
["Ingredieënt","Eenheid",null,"Kcal","Eiwit","Koolh.","Vet","kJ"]
["aalbessen",100,"g",{"$f":"0.24*B3","v":24},{"$f":"0.01*B3","v":1},{"$f":"0.05*B3","v":5},0,{"$f":"D3*4.1868","v":100.4832}]
["aardappelen",100,"g",{"$f":"0.848*B4","v":84.8},{"$f":"0.026*B4","v":2.6},{"$f":"0.186*B4","v":18.600000000000001},0,355.04064]
["aardappelkroketten",100,"g",{"$f":"3.56*B5","v":356},{"$f":"0.34*B5","v":34},{"$f":"0.282*B5","v":28.199999999999996},{"$f":"0.12*B5","v":12},1490.5008]
["aardappelpuree",100,"g",{"$f":"1*B6","v":100},{"$f":"0.028*B6","v":2.8000000000000003},{"$f":"0.11*B6","v":11},{"$f":"0.05*B6","v":5},418.68]
["aardappelschijfjes",100,"g",{"$f":"1.36*B7","v":136},{"$f":"0.02*B7","v":2},{"$f":"0.205*B7","v":20.5},{"$f":"0.05*B7","v":5},569.40480000000002]
["aardappelschijfjes (Aviko)",100,"g",{"$f":"1.25*B8","v":125},{"$f":"0.03*B8","v":3},{"$f":"0.185*B8","v":18.5},{"$f":"0.04*B8","v":4},523.35]
["aardappelschijfjes (CêlaVita)",100,"g",{"$f":"0.8*B9","v":80},{"$f":"0.22*B9","v":22},{"$f":"0.179*B9","v":17.899999999999999},{"$f":"0*B9","v":0},334.94399999999996]
["aardappelschijfjes (Colruyt)",100,"g",{"$f":"1.44*B10","v":144},{"$f":"0.024*B10","v":2.4},{"$f":"0.224*B10","v":22.400000000000002},{"$f":"0.05*B10","v":5},602.89919999999995]
["aardappelschijfjes (McCain)",100,"g",{"$f":"1.37*B11","v":137},{"$f":"0.022*B11","v":2.1999999999999997},{"$f":"0.207*B11","v":20.7},{"$f":"0.05*B11","v":5},573.59159999999997]
["aardappelschijfjes (Oerlemans)",100,"g",{"$f":"1.46*B12","v":146},{"$f":"0.03*B12","v":3},{"$f":"0.22*B12","v":22},{"$f":"0*B12","v":0},611.27279999999996]
["aardappelschijfjes (o'Lacy's)",100,"g",{"$f":"1.27*B13","v":127},{"$f":"0.02*B13","v":2},{"$f":"0.2*B13","v":20},{"$f":"0.04*B13","v":4},531.72360000000003]
["aardappelsoesje",100,"g",{"$f":"1.88*B14","v":188},{"$f":"0.053*B14","v":5.3},{"$f":"0.164*B14","v":16.400000000000002},{"$f":"0.112*B14","v":11.200000000000001},787.11839999999995]
["aardappelzetmeel",100,"g",{"$f":"3.37*B15","v":337},{"$f":"0.005*B15","v":0.5},{"$f":"0.838*B15","v":83.8},{"$f":"0.001*B15","v":0.1},1410.9515999999999]
["aardbeien",100,"g",{"$f":"0.24*B16","v":24},{"$f":"0.01*B16","v":1},{"$f":"0.05*B16","v":5},0,100.4832]
["abrikoos",1,"st",{"$f":"20*B17","v":20},0,{"$f":"5*B17","v":5},0,83.73599999999999]
["abrikozen-gebakje (vitalinea)",1,"st",{"$f":"102*B18","v":102},{"$f":"1.4*B18","v":1.4},{"$f":"18*B18","v":18},{"$f":"2.6*B18","v":2.6},427.05359999999996]
["all bran",100,"g",{"$f":"2.67*B19","v":267},{"$f":"0.14*B19","v":14.000000000000002},{"$f":"0.46*B19","v":46},{"$f":"0.03*B19","v":3},1117.8755999999998]
["amandelbroodje",100,"g",{"$f":"4.63*B20","v":463},{"$f":"0.076*B20","v":7.6},{"$f":"0.43*B20","v":43},{"$f":"0.289*B20","v":28.9},1938.4884]
["amandelen",100,"g",{"$f":"5.78*B21","v":578},{"$f":"0.183*B21","v":18.3},{"$f":"0.043*B21","v":4.3},{"$f":"0.542*B21","v":54.2},2419.9703999999997]
["americain",100,"g",{"$f":"1.25*B22","v":125},{"$f":"0.2*B22","v":20},0,{"$f":"0.05*B22","v":5},523.35]
["americain prepare",100,"g",{"$f":"2.44*B23","v":244},{"$f":"0.16*B23","v":16},{"$f":"0*B23","v":0},{"$f":"0.2*B23","v":20},1021.5792]
["amsoi (gekookt)",100,"g",{"$f":"0.28*B24","v":28.000000000000004},{"$f":"0.02*B24","v":2},{"$f":"0.05*B24","v":5},0,117.23040000000002]
["ananas",100,"g",{"$f":"0.88*B25","v":88},{"$f":"0*B25","v":0},{"$f":"0.22*B25","v":22},0,368.4384]
["andijvie",100,"g",{"$f":"0.17*B26","v":17},{"$f":"0.018*B26","v":1.7999999999999998},{"$f":"0.021*B26","v":2.1},{"$f":"0.002*B26","v":0.2},71.175600000000003]
["anijshagel",100,"g",{"$f":"3.93*B27","v":393},{"$f":"0.001*B27","v":0.1},{"$f":"0.982*B27","v":98.2},0,1645.4123999999999]
["ansjovis in olie",100,"g",{"$f":"1.89*B28","v":189},{"$f":"0.18*B28","v":18},{"$f":"0*B28","v":0},{"$f":"0.13*B28","v":13},791.30520000000001]
["appel",1,"st",{"$f":"60*B29","v":60},{"$f":"1*B29","v":1},{"$f":"14*B29","v":14},0,251.208]
["appelbeignet",100,"g",{"$f":"1.9*B30","v":190},{"$f":"0.026*B30","v":2.6},{"$f":"0.186*B30","v":18.600000000000001},{"$f":"0.117*B30","v":11.700000000000001},795.49199999999996]
{"$rows_left_out":963}
{"sheet":"Recept","index":2,"n_rows":54,"n_cols":15,"rows_kept":54,"cut":false,"hidden":false,"merged":[[10,1,10,2],[9,1,9,7],[9,8,9,14],[10,8,10,9]]}
["Uw huidig gewicht :",82,"kg"]
["Uw lengte:",188,"cm"]
["Mate aktiviteit:",2]
["Uw BMI:",{"$f":"B1/(B2*B2)*10000","v":23.20054323223178},"pnt"]
["U heeft nodig: Kcal ",{"$f":"B6/4.1868","v":2526.8576750496063},"Kcal"]
["kJ ",{"$f":"B4*(B3/10+1)*380","v":10579.447713897691},"kJ",null,"Totaal:",null,null,4,"personen",null,"P.persoon:"]
["eiwit ",{"$f":"B6*0.25/17","v":155.58011343967192},"g",null,"Kcal","Eiwit","Koolh.","Vet","kJ",null,"Kcal","Eiwit","Koolh.","Vet","kJ"]
["koolh ",{"$f":"B6*0.55/17","v":342.27624956727823},"g",null,{"$f":"SUM(K12:K54)","v":0},{"$f":"SUM(L12:L54)","v":0},{"$f":"SUM(M12:M54)","v":0},{"$f":"SUM(N12:N54)","v":0},{"$f":"SUM(O12:O54)","v":0},null,{"$f":"E8/$H$6","v":0},{"$f":"F8/$H$6","v":0},0,0,0]
["vet ",{"$f":"B6*0.2/38","v":55.681303757356268},"g"]
[null,"Calorieëntabel",null,null,null,null,null,null,"Recept"]
["Ingredieënt","Eenheid",null,"Kcal","Eiwit","Koolh.","Vet","kJ","Eenheid",null,"Kcal","Eiwit","Koolh.","Vet","kJ"]
[null,100,{"$f":"IF($A$12=\"\",\"\",VLOOKUP($A$12,CalTab!$A$3:$G$980,3,TRUE))","v":""},{"$f":"IF($A$12=\"\",\"\",VLOOKUP($A$12,CalTab!$A$3:$H$980,4,TRUE))","v":""},{"$f":"IF($A$12=\"\",\"\",VLOOKUP($A$12,CalTab!$A$3:$H$980,5,TRUE))","v":""},{"$f":"IF($A$12=\"\",\"\",VLOOKUP($A$12,CalTab!$A$3:$H$980,6,TRUE))","v":""},{"$f":"IF($A$12=\"\",\"\",VLOOKUP($A$12,CalTab!$A$3:$H$980,7,TRUE))","v":""},{"$f":"IF($A$12=\"\",\"\",VLOOKUP($A$12,CalTab!$A$3:$H$980,8,TRUE))","v":""},null,{"$f":"IF($A$12=\"\",\"\",VLOOKUP($A$12,CalTab!$A$3:$G$980,3,TRUE))","v":""},{"$f":"IF($A$12=\"\",\"\",D12*$I$12/$B$12)","v":""},{"$f":"IF($A$12=\"\",\"\",E12*$I$12/$B$12)","v":""},"","",""]
[null,{"$f":"IF($A$13=\"\",\"\",VLOOKUP($A$13,CalTab!$A$3:$G$980,2,TRUE))","v":""},{"$f":"IF($A$13=\"\",\"\",VLOOKUP($A$13,CalTab!$A$3:$G$980,3,TRUE))","v":""},{"$f":"IF($A$13=\"\",\"\",VLOOKUP($A$13,CalTab!$A$3:$H$980,4,TRUE))","v":""},{"$f":"IF($A$13=\"\",\"\",VLOOKUP($A$13,CalTab!$A$3:$H$980,5,TRUE))","v":""},{"$f":"IF($A$13=\"\",\"\",VLOOKUP($A$13,CalTab!$A$3:$H$980,6,TRUE))","v":""},{"$f":"IF($A$13=\"\",\"\",VLOOKUP($A$13,CalTab!$A$3:$H$980,7,TRUE))","v":""},{"$f":"IF($A$13=\"\",\"\",VLOOKUP($A$13,CalTab!$A$3:$H$980,8,TRUE))","v":""},null,{"$f":"IF($A$13=\"\",\"\",VLOOKUP($A$13,CalTab!$A$3:$G$980,3,TRUE))","v":""},{"$f":"IF($A$13=\"\",\"\",D13*$I$13/$B$13)","v":""},{"$f":"IF($A$13=\"\",\"\",VLOOKUP($A$13,CalTab!$A$3:$G$980,5,TRUE))","v":""},{"$f":"IF($A$13=\"\",\"\",VLOOKUP($A$13,CalTab!$A$3:$G$980,6,TRUE))","v":""},{"$f":"IF($A$13=\"\",\"\",VLOOKUP($A$13,CalTab!$A$3:$G$980,7,TRUE))","v":""},{"$f":"IF($A$13=\"\",\"\",H13*$I$13/$B$13)","v":""}]
[null,{"$f":"IF($A$14=\"\",\"\",VLOOKUP($A$14,CalTab!$A$3:$G$980,2,TRUE))","v":""},{"$f":"IF($A$14=\"\",\"\",VLOOKUP($A$14,CalTab!$A$3:$G$980,3,TRUE))","v":""},{"$f":"IF($A$14=\"\",\"\",VLOOKUP($A$14,CalTab!$A$3:$H$980,4,TRUE))","v":""},{"$f":"IF($A$14=\"\",\"\",VLOOKUP($A$14,CalTab!$A$3:$H$980,5,TRUE))","v":""},{"$f":"IF($A$14=\"\",\"\",VLOOKUP($A$14,CalTab!$A$3:$H$980,6,TRUE))","v":""},{"$f":"IF($A$14=\"\",\"\",VLOOKUP($A$14,CalTab!$A$3:$H$980,7,TRUE))","v":""},{"$f":"IF($A$14=\"\",\"\",VLOOKUP($A$14,CalTab!$A$3:$H$980,8,TRUE))","v":""},null,{"$f":"IF($A$14=\"\",\"\",VLOOKUP($A$14,CalTab!$A$3:$G$980,3,TRUE))","v":""},{"$f":"IF($A$14=\"\",\"\",D14*$I$14/$B$14)","v":""},{"$f":"IF($A$14=\"\",\"\",VLOOKUP($A$14,CalTab!$A$3:$G$980,5,TRUE))","v":""},{"$f":"IF($A$14=\"\",\"\",VLOOKUP($A$14,CalTab!$A$3:$G$980,6,TRUE))","v":""},{"$f":"IF($A$14=\"\",\"\",VLOOKUP($A$14,CalTab!$A$3:$G$980,7,TRUE))","v":""},{"$f":"IF($A$14=\"\",\"\",H14*$I$14/$B$14)","v":""}]
[null,{"$f":"IF($A$15=\"\",\"\",VLOOKUP($A$15,CalTab!$A$3:$G$980,2,TRUE))","v":""},{"$f":"IF($A$15=\"\",\"\",VLOOKUP($A$15,CalTab!$A$3:$G$980,3,TRUE))","v":""},{"$f":"IF($A$15=\"\",\"\",VLOOKUP($A$15,CalTab!$A$3:$H$980,4,TRUE))","v":""},{"$f":"IF($A$15=\"\",\"\",VLOOKUP($A$15,CalTab!$A$3:$H$980,5,TRUE))","v":""},{"$f":"IF($A$15=\"\",\"\",VLOOKUP($A$15,CalTab!$A$3:$H$980,6,TRUE))","v":""},{"$f":"IF($A$15=\"\",\"\",VLOOKUP($A$15,CalTab!$A$3:$H$980,7,TRUE))","v":""},{"$f":"IF($A$15=\"\",\"\",VLOOKUP($A$15,CalTab!$A$3:$H$980,8,TRUE))","v":""},null,{"$f":"IF($A$15=\"\",\"\",VLOOKUP($A$15,CalTab!$A$3:$G$980,3,TRUE))","v":""},{"$f":"IF($A$15=\"\",\"\",D15*$I$15/$B$15)","v":""},{"$f":"IF($A$15=\"\",\"\",VLOOKUP($A$15,CalTab!$A$3:$G$980,5,TRUE))","v":""},{"$f":"IF($A$15=\"\",\"\",VLOOKUP($A$15,CalTab!$A$3:$G$980,6,TRUE))","v":""},{"$f":"IF($A$15=\"\",\"\",VLOOKUP($A$15,CalTab!$A$3:$G$980,7,TRUE))","v":""},{"$f":"IF($A$15=\"\",\"\",H15*$I$15/$B$15)","v":""}]
[null,{"$f":"IF($A$16=\"\",\"\",VLOOKUP($A$16,CalTab!$A$3:$G$980,2,TRUE))","v":""},{"$f":"IF($A$16=\"\",\"\",VLOOKUP($A$16,CalTab!$A$3:$G$980,3,TRUE))","v":""},{"$f":"IF($A$16=\"\",\"\",VLOOKUP($A$16,CalTab!$A$3:$H$980,4,TRUE))","v":""},{"$f":"IF($A$16=\"\",\"\",VLOOKUP($A$16,CalTab!$A$3:$H$980,5,TRUE))","v":""},{"$f":"IF($A$16=\"\",\"\",VLOOKUP($A$16,CalTab!$A$3:$H$980,6,TRUE))","v":""},{"$f":"IF($A$16=\"\",\"\",VLOOKUP($A$16,CalTab!$A$3:$H$980,7,TRUE))","v":""},{"$f":"IF($A$16=\"\",\"\",VLOOKUP($A$16,CalTab!$A$3:$H$980,8,TRUE))","v":""},null,{"$f":"IF($A$16=\"\",\"\",VLOOKUP($A$16,CalTab!$A$3:$G$980,3,TRUE))","v":""},{"$f":"IF($A$16=\"\",\"\",D16*$I$16/$B$16)","v":""},{"$f":"IF($A$16=\"\",\"\",VLOOKUP($A$16,CalTab!$A$3:$G$980,5,TRUE))","v":""},{"$f":"IF($A$16=\"\",\"\",VLOOKUP($A$16,CalTab!$A$3:$G$980,6,TRUE))","v":""},{"$f":"IF($A$16=\"\",\"\",VLOOKUP($A$16,CalTab!$A$3:$G$980,7,TRUE))","v":""},{"$f":"IF($A$16=\"\",\"\",H16*$I$16/$B$16)","v":""}]
[null,{"$f":"IF($A$17=\"\",\"\",VLOOKUP($A$17,CalTab!$A$3:$G$980,2,TRUE))","v":""},{"$f":"IF($A$17=\"\",\"\",VLOOKUP($A$17,CalTab!$A$3:$G$980,3,TRUE))","v":""},{"$f":"IF($A$17=\"\",\"\",VLOOKUP($A$17,CalTab!$A$3:$H$980,4,TRUE))","v":""},{"$f":"IF($A$17=\"\",\"\",VLOOKUP($A$17,CalTab!$A$3:$H$980,5,TRUE))","v":""},{"$f":"IF($A$17=\"\",\"\",VLOOKUP($A$17,CalTab!$A$3:$H$980,6,TRUE))","v":""},{"$f":"IF($A$17=\"\",\"\",VLOOKUP($A$17,CalTab!$A$3:$H$980,7,TRUE))","v":""},{"$f":"IF($A$17=\"\",\"\",VLOOKUP($A$17,CalTab!$A$3:$H$980,8,TRUE))","v":""},null,{"$f":"IF($A$17=\"\",\"\",VLOOKUP($A$17,CalTab!$A$3:$G$980,3,TRUE))","v":""},{"$f":"IF($A$17=\"\",\"\",D17*$I$17/$B$17)","v":""},{"$f":"IF($A$17=\"\",\"\",VLOOKUP($A$17,CalTab!$A$3:$G$980,5,TRUE))","v":""},{"$f":"IF($A$17=\"\",\"\",VLOOKUP($A$17,CalTab!$A$3:$G$980,6,TRUE))","v":""},{"$f":"IF($A$17=\"\",\"\",VLOOKUP($A$17,CalTab!$A$3:$G$980,7,TRUE))","v":""},{"$f":"IF($A$17=\"\",\"\",H17*$I$17/$B$17)","v":""}]
[null,{"$f":"IF($A$18=\"\",\"\",VLOOKUP($A$18,CalTab!$A$3:$G$980,2,TRUE))","v":""},{"$f":"IF($A$18=\"\",\"\",VLOOKUP($A$18,CalTab!$A$3:$G$980,3,TRUE))","v":""},{"$f":"IF($A$18=\"\",\"\",VLOOKUP($A$18,CalTab!$A$3:$H$980,4,TRUE))","v":""},{"$f":"IF($A$18=\"\",\"\",VLOOKUP($A$18,CalTab!$A$3:$H$980,5,TRUE))","v":""},{"$f":"IF($A$18=\"\",\"\",VLOOKUP($A$18,CalTab!$A$3:$H$980,6,TRUE))","v":""},{"$f":"IF($A$18=\"\",\"\",VLOOKUP($A$18,CalTab!$A$3:$H$980,7,TRUE))","v":""},{"$f":"IF($A$18=\"\",\"\",VLOOKUP($A$18,CalTab!$A$3:$H$980,8,TRUE))","v":""},null,{"$f":"IF($A$18=\"\",\"\",VLOOKUP($A$18,CalTab!$A$3:$G$980,3,TRUE))","v":""},{"$f":"IF($A$18=\"\",\"\",D18*$I$18/$B$18)","v":""},{"$f":"IF($A$18=\"\",\"\",VLOOKUP($A$18,CalTab!$A$3:$G$980,5,TRUE))","v":""},{"$f":"IF($A$18=\"\",\"\",VLOOKUP($A$18,CalTab!$A$3:$G$980,6,TRUE))","v":""},{"$f":"IF($A$18=\"\",\"\",VLOOKUP($A$18,CalTab!$A$3:$G$980,7,TRUE))","v":""},{"$f":"IF($A$18=\"\",\"\",H18*$I$18/$B$18)","v":""}]
[null,{"$f":"IF($A$19=\"\",\"\",VLOOKUP($A$19,CalTab!$A$3:$G$980,2,TRUE))","v":""},{"$f":"IF($A$19=\"\",\"\",VLOOKUP($A$19,CalTab!$A$3:$G$980,3,TRUE))","v":""},{"$f":"IF($A$19=\"\",\"\",VLOOKUP($A$19,CalTab!$A$3:$H$980,4,TRUE))","v":""},{"$f":"IF($A$19=\"\",\"\",VLOOKUP($A$19,CalTab!$A$3:$H$980,5,TRUE))","v":""},{"$f":"IF($A$19=\"\",\"\",VLOOKUP($A$19,CalTab!$A$3:$H$980,6,TRUE))","v":""},{"$f":"IF($A$19=\"\",\"\",VLOOKUP($A$19,CalTab!$A$3:$H$980,7,TRUE))","v":""},{"$f":"IF($A$19=\"\",\"\",VLOOKUP($A$19,CalTab!$A$3:$H$980,8,TRUE))","v":""},null,{"$f":"IF($A$19=\"\",\"\",VLOOKUP($A$19,CalTab!$A$3:$G$980,3,TRUE))","v":""},{"$f":"IF($A$19=\"\",\"\",D19*$I$19/$B$19)","v":""},{"$f":"IF($A$19=\"\",\"\",VLOOKUP($A$19,CalTab!$A$3:$G$980,5,TRUE))","v":""},{"$f":"IF($A$19=\"\",\"\",VLOOKUP($A$19,CalTab!$A$3:$G$980,6,TRUE))","v":""},{"$f":"IF($A$19=\"\",\"\",VLOOKUP($A$19,CalTab!$A$3:$G$980,7,TRUE))","v":""},{"$f":"IF($A$19=\"\",\"\",H19*$I$19/$B$19)","v":""}]
[null,{"$f":"IF($A$20=\"\",\"\",VLOOKUP($A$20,CalTab!$A$3:$G$980,2,TRUE))","v":""},{"$f":"IF($A$20=\"\",\"\",VLOOKUP($A$20,CalTab!$A$3:$G$980,3,TRUE))","v":""},{"$f":"IF($A$20=\"\",\"\",VLOOKUP($A$20,CalTab!$A$3:$H$980,4,TRUE))","v":""},{"$f":"IF($A$20=\"\",\"\",VLOOKUP($A$20,CalTab!$A$3:$H$980,5,TRUE))","v":""},{"$f":"IF($A$20=\"\",\"\",VLOOKUP($A$20,CalTab!$A$3:$H$980,6,TRUE))","v":""},{"$f":"IF($A$20=\"\",\"\",VLOOKUP($A$20,CalTab!$A$3:$H$980,7,TRUE))","v":""},{"$f":"IF($A$20=\"\",\"\",VLOOKUP($A$20,CalTab!$A$3:$H$980,8,TRUE))","v":""},null,{"$f":"IF($A$20=\"\",\"\",VLOOKUP($A$20,CalTab!$A$3:$G$980,3,TRUE))","v":""},{"$f":"IF($A$20=\"\",\"\",D20*$I$20/$B$20)","v":""},{"$f":"IF($A$20=\"\",\"\",VLOOKUP($A$20,CalTab!$A$3:$G$980,5,TRUE))","v":""},{"$f":"IF($A$20=\"\",\"\",VLOOKUP($A$20,CalTab!$A$3:$G$980,6,TRUE))","v":""},{"$f":"IF($A$20=\"\",\"\",VLOOKUP($A$20,CalTab!$A$3:$G$980,7,TRUE))","v":""},{"$f":"IF($A$20=\"\",\"\",H20*$I$20/$B$20)","v":""}]
[null,{"$f":"IF($A$21=\"\",\"\",VLOOKUP($A$21,CalTab!$A$3:$G$980,2,TRUE))","v":""},{"$f":"IF($A$21=\"\",\"\",VLOOKUP($A$21,CalTab!$A$3:$G$980,3,TRUE))","v":""},{"$f":"IF($A$21=\"\",\"\",VLOOKUP($A$21,CalTab!$A$3:$H$980,4,TRUE))","v":""},{"$f":"IF($A$21=\"\",\"\",VLOOKUP($A$21,CalTab!$A$3:$H$980,5,TRUE))","v":""},{"$f":"IF($A$21=\"\",\"\",VLOOKUP($A$21,CalTab!$A$3:$H$980,6,TRUE))","v":""},{"$f":"IF($A$21=\"\",\"\",VLOOKUP($A$21,CalTab!$A$3:$H$980,7,TRUE))","v":""},{"$f":"IF($A$21=\"\",\"\",VLOOKUP($A$21,CalTab!$A$3:$H$980,8,TRUE))","v":""},null,{"$f":"IF($A$21=\"\",\"\",VLOOKUP($A$21,CalTab!$A$3:$G$980,3,TRUE))","v":""},{"$f":"IF($A$21=\"\",\"\",D21*$I$21/$B$21)","v":""},{"$f":"IF($A$21=\"\",\"\",VLOOKUP($A$21,CalTab!$A$3:$G$980,5,TRUE))","v":""},{"$f":"IF($A$21=\"\",\"\",VLOOKUP($A$21,CalTab!$A$3:$G$980,6,TRUE))","v":""},{"$f":"IF($A$21=\"\",\"\",VLOOKUP($A$21,CalTab!$A$3:$G$980,7,TRUE))","v":""},{"$f":"IF($A$21=\"\",\"\",H21*$I$21/$B$21)","v":""}]
[null,{"$f":"IF($A$22=\"\",\"\",VLOOKUP($A$22,CalTab!$A$3:$G$980,2,TRUE))","v":""},{"$f":"IF($A$22=\"\",\"\",VLOOKUP($A$22,CalTab!$A$3:$G$980,3,TRUE))","v":""},{"$f":"IF($A$22=\"\",\"\",VLOOKUP($A$22,CalTab!$A$3:$H$980,4,TRUE))","v":""},{"$f":"IF($A$22=\"\",\"\",VLOOKUP($A$22,CalTab!$A$3:$H$980,5,TRUE))","v":""},{"$f":"IF($A$22=\"\",\"\",VLOOKUP($A$22,CalTab!$A$3:$H$980,6,TRUE))","v":""},{"$f":"IF($A$22=\"\",\"\",VLOOKUP($A$22,CalTab!$A$3:$H$980,7,TRUE))","v":""},{"$f":"IF($A$22=\"\",\"\",VLOOKUP($A$22,CalTab!$A$3:$H$980,8,TRUE))","v":""},null,{"$f":"IF($A$22=\"\",\"\",VLOOKUP($A$22,CalTab!$A$3:$G$980,3,TRUE))","v":""},{"$f":"IF($A$22=\"\",\"\",D22*$I$22/$B$22)","v":""},{"$f":"IF($A$22=\"\",\"\",VLOOKUP($A$22,CalTab!$A$3:$G$980,5,TRUE))","v":""},{"$f":"IF($A$22=\"\",\"\",VLOOKUP($A$22,CalTab!$A$3:$G$980,6,TRUE))","v":""},{"$f":"IF($A$22=\"\",\"\",VLOOKUP($A$22,CalTab!$A$3:$G$980,7,TRUE))","v":""},{"$f":"IF($A$22=\"\",\"\",H22*$I$22/$B$22)","v":""}]
[null,{"$f":"IF($A$23=\"\",\"\",VLOOKUP($A$23,CalTab!$A$3:$G$980,2,TRUE))","v":""},{"$f":"IF($A$23=\"\",\"\",VLOOKUP($A$23,CalTab!$A$3:$G$980,3,TRUE))","v":""},{"$f":"IF($A$23=\"\",\"\",VLOOKUP($A$23,CalTab!$A$3:$H$980,4,TRUE))","v":""},{"$f":"IF($A$23=\"\",\"\",VLOOKUP($A$23,CalTab!$A$3:$H$980,5,TRUE))","v":""},{"$f":"IF($A$23=\"\",\"\",VLOOKUP($A$23,CalTab!$A$3:$H$980,6,TRUE))","v":""},{"$f":"IF($A$23=\"\",\"\",VLOOKUP($A$23,CalTab!$A$3:$H$980,7,TRUE))","v":""},{"$f":"IF($A$23=\"\",\"\",VLOOKUP($A$23,CalTab!$A$3:$H$980,8,TRUE))","v":""},null,{"$f":"IF($A$23=\"\",\"\",VLOOKUP($A$23,CalTab!$A$3:$G$980,3,TRUE))","v":""},{"$f":"IF($A$23=\"\",\"\",D23*$I$23/$B$23)","v":""},{"$f":"IF($A$23=\"\",\"\",VLOOKUP($A$23,CalTab!$A$3:$G$980,5,TRUE))","v":""},{"$f":"IF($A$23=\"\",\"\",VLOOKUP($A$23,CalTab!$A$3:$G$980,6,TRUE))","v":""},{"$f":"IF($A$23=\"\",\"\",VLOOKUP($A$23,CalTab!$A$3:$G$980,7,TRUE))","v":""},{"$f":"IF($A$23=\"\",\"\",H23*$I$23/$B$23)","v":""}]
[null,{"$f":"IF($A$24=\"\",\"\",VLOOKUP($A$24,CalTab!$A$3:$G$980,2,TRUE))","v":""},{"$f":"IF($A$24=\"\",\"\",VLOOKUP($A$24,CalTab!$A$3:$G$980,3,TRUE))","v":""},{"$f":"IF($A$24=\"\",\"\",VLOOKUP($A$24,CalTab!$A$3:$H$980,4,TRUE))","v":""},{"$f":"IF($A$24=\"\",\"\",VLOOKUP($A$24,CalTab!$A$3:$H$980,5,TRUE))","v":""},{"$f":"IF($A$24=\"\",\"\",VLOOKUP($A$24,CalTab!$A$3:$H$980,6,TRUE))","v":""},{"$f":"IF($A$24=\"\",\"\",VLOOKUP($A$24,CalTab!$A$3:$H$980,7,TRUE))","v":""},{"$f":"IF($A$24=\"\",\"\",VLOOKUP($A$24,CalTab!$A$3:$H$980,8,TRUE))","v":""},null,{"$f":"IF($A$24=\"\",\"\",VLOOKUP($A$24,CalTab!$A$3:$G$980,3,TRUE))","v":""},{"$f":"IF($A$24=\"\",\"\",D24*$I$24/$B$24)","v":""},{"$f":"IF($A$24=\"\",\"\",VLOOKUP($A$24,CalTab!$A$3:$G$980,5,TRUE))","v":""},{"$f":"IF($A$24=\"\",\"\",VLOOKUP($A$24,CalTab!$A$3:$G$980,6,TRUE))","v":""},{"$f":"IF($A$24=\"\",\"\",VLOOKUP($A$24,CalTab!$A$3:$G$980,7,TRUE))","v":""},{"$f":"IF($A$24=\"\",\"\",H24*$I$24/$B$24)","v":""}]
[null,{"$f":"IF($A$25=\"\",\"\",VLOOKUP($A$25,CalTab!$A$3:$G$980,2,TRUE))","v":""},{"$f":"IF($A$25=\"\",\"\",VLOOKUP($A$25,CalTab!$A$3:$G$980,3,TRUE))","v":""},{"$f":"IF($A$25=\"\",\"\",VLOOKUP($A$25,CalTab!$A$3:$H$980,4,TRUE))","v":""},{"$f":"IF($A$25=\"\",\"\",VLOOKUP($A$25,CalTab!$A$3:$H$980,5,TRUE))","v":""},{"$f":"IF($A$25=\"\",\"\",VLOOKUP($A$25,CalTab!$A$3:$H$980,6,TRUE))","v":""},{"$f":"IF($A$25=\"\",\"\",VLOOKUP($A$25,CalTab!$A$3:$H$980,7,TRUE))","v":""},{"$f":"IF($A$25=\"\",\"\",VLOOKUP($A$25,CalTab!$A$3:$H$980,8,TRUE))","v":""},null,{"$f":"IF($A$25=\"\",\"\",VLOOKUP($A$25,CalTab!$A$3:$G$980,3,TRUE))","v":""},{"$f":"IF($A$25=\"\",\"\",D25*$I$25/$B$25)","v":""},{"$f":"IF($A$25=\"\",\"\",VLOOKUP($A$25,CalTab!$A$3:$G$980,5,TRUE))","v":""},{"$f":"IF($A$25=\"\",\"\",VLOOKUP($A$25,CalTab!$A$3:$G$980,6,TRUE))","v":""},{"$f":"IF($A$25=\"\",\"\",VLOOKUP($A$25,CalTab!$A$3:$G$980,7,TRUE))","v":""},{"$f":"IF($A$25=\"\",\"\",H25*$I$25/$B$25)","v":""}]
[null,{"$f":"IF($A$26=\"\",\"\",VLOOKUP($A$26,CalTab!$A$3:$G$980,2,TRUE))","v":""},{"$f":"IF($A$26=\"\",\"\",VLOOKUP($A$26,CalTab!$A$3:$G$980,3,TRUE))","v":""},{"$f":"IF($A$26=\"\",\"\",VLOOKUP($A$26,CalTab!$A$3:$H$980,4,TRUE))","v":""},{"$f":"IF($A$26=\"\",\"\",VLOOKUP($A$26,CalTab!$A$3:$H$980,5,TRUE))","v":""},{"$f":"IF($A$26=\"\",\"\",VLOOKUP($A$26,CalTab!$A$3:$H$980,6,TRUE))","v":""},{"$f":"IF($A$26=\"\",\"\",VLOOKUP($A$26,CalTab!$A$3:$H$980,7,TRUE))","v":""},{"$f":"IF($A$26=\"\",\"\",VLOOKUP($A$26,CalTab!$A$3:$H$980,8,TRUE))","v":""},null,{"$f":"IF($A$26=\"\",\"\",VLOOKUP($A$26,CalTab!$A$3:$G$980,3,TRUE))","v":""},{"$f":"IF($A$26=\"\",\"\",D26*$I$26/$B$26)","v":""},{"$f":"IF($A$26=\"\",\"\",VLOOKUP($A$26,CalTab!$A$3:$G$980,5,TRUE))","v":""},{"$f":"IF($A$26=\"\",\"\",VLOOKUP($A$26,CalTab!$A$3:$G$980,6,TRUE))","v":""},{"$f":"IF($A$26=\"\",\"\",VLOOKUP($A$26,CalTab!$A$3:$G$980,7,TRUE))","v":""},{"$f":"IF($A$26=\"\",\"\",H26*$I$26/$B$26)","v":""}]
[null,{"$f":"IF($A$27=\"\",\"\",VLOOKUP($A$27,CalTab!$A$3:$G$980,2,TRUE))","v":""},{"$f":"IF($A$27=\"\",\"\",VLOOKUP($A$27,CalTab!$A$3:$G$980,3,TRUE))","v":""},{"$f":"IF($A$27=\"\",\"\",VLOOKUP($A$27,CalTab!$A$3:$H$980,4,TRUE))","v":""},{"$f":"IF($A$27=\"\",\"\",VLOOKUP($A$27,CalTab!$A$3:$H$980,5,TRUE))","v":""},{"$f":"IF($A$27=\"\",\"\",VLOOKUP($A$27,CalTab!$A$3:$H$980,6,TRUE))","v":""},{"$f":"IF($A$27=\"\",\"\",VLOOKUP($A$27,CalTab!$A$3:$H$980,7,TRUE))","v":""},{"$f":"IF($A$27=\"\",\"\",VLOOKUP($A$27,CalTab!$A$3:$H$980,8,TRUE))","v":""},null,{"$f":"IF($A$27=\"\",\"\",VLOOKUP($A$27,CalTab!$A$3:$G$980,3,TRUE))","v":""},{"$f":"IF($A$27=\"\",\"\",D27*$I$27/$B$27)","v":""},{"$f":"IF($A$27=\"\",\"\",VLOOKUP($A$27,CalTab!$A$3:$G$980,5,TRUE))","v":""},{"$f":"IF($A$27=\"\",\"\",VLOOKUP($A$27,CalTab!$A$3:$G$980,6,TRUE))","v":""},{"$f":"IF($A$27=\"\",\"\",VLOOKUP($A$27,CalTab!$A$3:$G$980,7,TRUE))","v":""},{"$f":"IF($A$27=\"\",\"\",H27*$I$27/$B$27)","v":""}]
[null,{"$f":"IF($A$28=\"\",\"\",VLOOKUP($A$28,CalTab!$A$3:$G$980,2,TRUE))","v":""},{"$f":"IF($A$28=\"\",\"\",VLOOKUP($A$28,CalTab!$A$3:$G$980,3,TRUE))","v":""},{"$f":"IF($A$28=\"\",\"\",VLOOKUP($A$28,CalTab!$A$3:$H$980,4,TRUE))","v":""},{"$f":"IF($A$28=\"\",\"\",VLOOKUP($A$28,CalTab!$A$3:$H$980,5,TRUE))","v":""},{"$f":"IF($A$28=\"\",\"\",VLOOKUP($A$28,CalTab!$A$3:$H$980,6,TRUE))","v":""},{"$f":"IF($A$28=\"\",\"\",VLOOKUP($A$28,CalTab!$A$3:$H$980,7,TRUE))","v":""},{"$f":"IF($A$28=\"\",\"\",VLOOKUP($A$28,CalTab!$A$3:$H$980,8,TRUE))","v":""},null,{"$f":"IF($A$28=\"\",\"\",VLOOKUP($A$28,CalTab!$A$3:$G$980,3,TRUE))","v":""},{"$f":"IF($A$28=\"\",\"\",D28*$I$28/$B$28)","v":""},{"$f":"IF($A$28=\"\",\"\",VLOOKUP($A$28,CalTab!$A$3:$G$980,5,TRUE))","v":""},{"$f":"IF($A$28=\"\",\"\",VLOOKUP($A$28,CalTab!$A$3:$G$980,6,TRUE))","v":""},{"$f":"IF($A$28=\"\",\"\",VLOOKUP($A$28,CalTab!$A$3:$G$980,7,TRUE))","v":""},{"$f":"IF($A$28=\"\",\"\",H28*$I$28/$B$28)","v":""}]
[null,{"$f":"IF($A$29=\"\",\"\",VLOOKUP($A$29,CalTab!$A$3:$G$980,2,TRUE))","v":""},{"$f":"IF($A$29=\"\",\"\",VLOOKUP($A$29,CalTab!$A$3:$G$980,3,TRUE))","v":""},{"$f":"IF($A$29=\"\",\"\",VLOOKUP($A$29,CalTab!$A$3:$H$980,4,TRUE))","v":""},{"$f":"IF($A$29=\"\",\"\",VLOOKUP($A$29,CalTab!$A$3:$H$980,5,TRUE))","v":""},{"$f":"IF($A$29=\"\",\"\",VLOOKUP($A$29,CalTab!$A$3:$H$980,6,TRUE))","v":""},{"$f":"IF($A$29=\"\",\"\",VLOOKUP($A$29,CalTab!$A$3:$H$980,7,TRUE))","v":""},{"$f":"IF($A$29=\"\",\"\",VLOOKUP($A$29,CalTab!$A$3:$H$980,8,TRUE))","v":""},null,{"$f":"IF($A$29=\"\",\"\",VLOOKUP($A$29,CalTab!$A$3:$G$980,3,TRUE))","v":""},{"$f":"IF($A$29=\"\",\"\",D29*$I$29/$B$29)","v":""},{"$f":"IF($A$29=\"\",\"\",VLOOKUP($A$29,CalTab!$A$3:$G$980,5,TRUE))","v":""},{"$f":"IF($A$29=\"\",\"\",VLOOKUP($A$29,CalTab!$A$3:$G$980,6,TRUE))","v":""},{"$f":"IF($A$29=\"\",\"\",VLOOKUP($A$29,CalTab!$A$3:$G$980,7,TRUE))","v":""},{"$f":"IF($A$29=\"\",\"\",H29*$I$29/$B$29)","v":""}]
[null,{"$f":"IF($A$30=\"\",\"\",VLOOKUP($A$30,CalTab!$A$3:$G$980,2,TRUE))","v":""},{"$f":"IF($A$30=\"\",\"\",VLOOKUP($A$30,CalTab!$A$3:$G$980,3,TRUE))","v":""},{"$f":"IF($A$30=\"\",\"\",VLOOKUP($A$30,CalTab!$A$3:$H$980,4,TRUE))","v":""},{"$f":"IF($A$30=\"\",\"\",VLOOKUP($A$30,CalTab!$A$3:$H$980,5,TRUE))","v":""},{"$f":"IF($A$30=\"\",\"\",VLOOKUP($A$30,CalTab!$A$3:$H$980,6,TRUE))","v":""},{"$f":"IF($A$30=\"\",\"\",VLOOKUP($A$30,CalTab!$A$3:$H$980,7,TRUE))","v":""},{"$f":"IF($A$30=\"\",\"\",VLOOKUP($A$30,CalTab!$A$3:$H$980,8,TRUE))","v":""},null,{"$f":"IF($A$30=\"\",\"\",VLOOKUP($A$30,CalTab!$A$3:$G$980,3,TRUE))","v":""},{"$f":"IF($A$30=\"\",\"\",D30*$I$30/$B$30)","v":""},{"$f":"IF($A$30=\"\",\"\",VLOOKUP($A$30,CalTab!$A$3:$G$980,5,TRUE))","v":""},{"$f":"IF($A$30=\"\",\"\",VLOOKUP($A$30,CalTab!$A$3:$G$980,6,TRUE))","v":""},{"$f":"IF($A$30=\"\",\"\",VLOOKUP($A$30,CalTab!$A$3:$G$980,7,TRUE))","v":""},{"$f":"IF($A$30=\"\",\"\",H30*$I$30/$B$30)","v":""}]
{"$rows_left_out":24}